Reaction Details
TargetGlucocorticoid receptor
LigandBDBM50221175
Substrate/Competitorn/a
Meas. Tech.ChEMBL_457478 (CHEMBL941996)
Ki 13±n/a nM
Citation Clark, RDRay, NCBlaney, PCrackett, PHHurley, CWilliams, KDyke, HJClark, DELockey, PMDevos, RWong, MWhite, ABelanoff, JK 2-Benzenesulfonyl-8a-benzyl-hexahydro-2H-isoquinolin-6-ones as selective glucocorticoid receptor antagonists. Bioorg Med Chem Lett17:5704-8 (2007) 
 
Glucocorticoid receptor
Name:Glucocorticoid receptor
Type:Enzyme
Mol. Mass.:85656.87
Organism:Homo sapiens (Human)
Description:P04150
Residue:777
BDBM50221175
NameBDBM50221175
Synonyms:2-[(4-tert-butylbenzene)sulfonyl]-8a-({4-[(dimethylsulfamoyl)amino]phenyl}methyl)-1,2,3,4,6,7,8,8a-octahydroisoquinolin-6-one | CHEMBL248027
TypeSmall organic molecule
Emp. Form.C28H37N3O5S2
Mol. Mass.559.74
SMILESCN(C)S(=O)(=O)Nc1ccc(CC23CCC(=O)C=C2CCN(C3)S(=O)(=O)c2ccc(cc2)C(C)(C)C)cc1