Reaction Details
TargetDipeptidyl peptidase 4
LigandBDBM50222468
Substrate/Competitorn/a
Meas. Tech.ChEMBL_457874 (CHEMBL924146)
IC50 60±n/a nM
Citation Chen, PCaldwell, CGMathvink, RJLeiting, BMarsilio, FPatel, RAWu, JKHe, HLyons, KAThornberry, NAWeber, AE Imidazopiperidine amides as dipeptidyl peptidase IV inhibitors for the treatment of diabetes. Bioorg Med Chem Lett17:5853-7 (2007) 
 
Dipeptidyl peptidase 4
Name:Dipeptidyl peptidase 4
Type:Enzyme
Mol. Mass.:88271.01
Organism:Homo sapiens (Human)
Description:P27487
Residue:766
BDBM50222468
NameBDBM50222468
Synonyms:(3R)-3-amino-1-(4-ethyl-1-methyl-2-(trifluoromethyl)-6,7-dihydro-1H-imidazo[4,5-c]pyridin-5(4H)-yl)-4-(2,4,5-trifluorophenyl)butan-1-one | CHEMBL250204
TypeSmall organic molecule
Emp. Form.C20H22F6N4O
Mol. Mass.448.4053
SMILESCCC1N(CCc2c1nc(n2C)C(F)(F)F)C(=O)C[C@H](N)Cc1cc(F)c(F)cc1F