Reaction Details
TargetCannabinoid receptor 2
LigandBDBM50222838
Substrate/Competitorn/a
Meas. Tech.ChEMBL_458048 (CHEMBL925386)
IC50 110±n/a nM
Citation Ohta, HIshizaka, TTatsuzuki, MYoshinaga, MIida, ITomishima, YToda, YSaito, S N-Alkylidenearylcarboxamides as new potent and selective CB(2) cannabinoid receptor agonists with good oral bioavailability. Bioorg Med Chem Lett17:6299-304 (2007) 
 
Cannabinoid receptor 2
Name:Cannabinoid receptor 2
Type:G Protein-Coupled Receptor (GPCR)
Mol. Mass.:39690.94
Organism:Homo sapiens (Human)
Description:P34972
Residue:360
BDBM50222838
NameBDBM50222838
Synonyms:CHEMBL248201 | ethyl 3-(cyclopropylmethyl)-4-methyl-2-(3-(trifluoromethyl)benzamido)-2,3-dihydrothiazole-5-carboxylate
TypeSmall organic molecule
Emp. Form.C19H19F3N2O3S
Mol. Mass.412.426
SMILESCCOC(=O)c1s\c(=N/C(=O)c2cccc(c2)C(F)(F)F)n(CC2CC2)c1C