Reaction Details
TargetCannabinoid receptor 2
LigandBDBM50222844
Substrate/Competitorn/a
Meas. Tech.ChEMBL_458048 (CHEMBL925386)
IC50 2.3±n/a nM
Citation Ohta, HIshizaka, TTatsuzuki, MYoshinaga, MIida, ITomishima, YToda, YSaito, S N-Alkylidenearylcarboxamides as new potent and selective CB(2) cannabinoid receptor agonists with good oral bioavailability. Bioorg Med Chem Lett17:6299-304 (2007) 
 
Cannabinoid receptor 2
Name:Cannabinoid receptor 2
Type:G Protein-Coupled Receptor (GPCR)
Mol. Mass.:39690.94
Organism:Homo sapiens (Human)
Description:P34972
Residue:360
BDBM50222844
NameBDBM50222844
Synonyms:CHEMBL248015 | N-(5-tert-butyl-3-(2-ethoxyethyl)-4-methylthiazol-2(3H)-ylidene)-3-(trifluoromethyl)benzamide
TypeSmall organic molecule
Emp. Form.C20H25F3N2O2S
Mol. Mass.414.485
SMILESCCOCCn1c(C)c(s\c1=N/C(=O)c1cccc(c1)C(F)(F)F)C(C)(C)C