Reaction Details
TargetEstrogen receptor beta
LigandBDBM50223235
Substrate/Competitorn/a
Meas. Tech.ChEMBL_458135 (CHEMBL925468)
IC50 9±n/a nM
Citation Blizzard, TAGude, CMorgan, JDChan, WBirzin, ETMojena, MTudela, CChen, FKnecht, KSu, QKraker, BMosley, RTHolmes, MARohrer, SPHammond, ML Androstene-3,5-dienes as ER-beta selective SERMs. Bioorg Med Chem Lett17:6295-8 (2007) 
 
Estrogen receptor beta
Name:Estrogen receptor beta
Type:Protein
Mol. Mass.:59238.43
Organism:Homo sapiens (Human)
Description:Q92731
Residue:530
BDBM50223235
NameBDBM50223235
Synonyms:(8R,9S,10S,13S,14S,17S)-3,13-dimethyl-10-vinyl-2,7,8,9,10,11,12,13,14,15,16,17-dodecahydro-1H-cyclopenta[a]phenanthren-17-ol | CHEMBL398456
TypeSmall organic molecule
Emp. Form.C21H30O
Mol. Mass.298.4623
SMILESCC1=CC2=CC[C@H]3[C@@H]4CC[C@H](O)[C@@]4(C)CC[C@@H]3[C@]2(CC1)C=C