Reaction Details
TargetProstaglandin E2 receptor EP4 subtype
LigandBDBM50224572
Substrate/Competitorn/a
Meas. Tech.ChEMBL_458318 (CHEMBL925649)
Ki 18±n/a nM
Citation Zhao, ZAraldi, GLXiao, YReddy, APLiao, YKarra, SBrugger, NFischer, DPalmer, E Synthesis and evaluation of novel pyrazolidinone analogs of PGE2 as EP2 and EP4 receptors agonists. Bioorg Med Chem Lett17:6572-5 (2007) 
 
Prostaglandin E2 receptor EP4 subtype
Name:Prostaglandin E2 receptor EP4 subtype
Type:Enzyme
Mol. Mass.:53134.53
Organism:Homo sapiens (Human)
Description:P35408
Residue:488
BDBM50224572
NameBDBM50224572
Synonyms:4-(2-(2-(4-(3-chlorophenyl)-3-hydroxybutyl)-5-oxopyrazolidin-1-yl)ethyl)benzoic acid | CHEMBL249744
TypeSmall organic molecule
Emp. Form.C22H25ClN2O4
Mol. Mass.416.898
SMILESOC(CCN1CCC(=O)N1CCc1ccc(cc1)C(O)=O)Cc1cccc(Cl)c1