Reaction Details
TargetKappa-type opioid receptor
LigandBDBM50224873
Substrate/Competitorn/a
Meas. Tech.ChEMBL_458383 (CHEMBL942702)
EC50 1.1±n/a nM
Citation VanAlstine, MAWentland, MPCohen, DJBidlack, JM Redefining the structure-activity relationships of 2,6-methano-3-benzazocines. 5. Opioid receptor binding properties of N-((4'-phenyl)-phenethyl) analogues of 8-CAC. Bioorg Med Chem Lett17:6516-20 (2007) 
 
Kappa-type opioid receptor
Name:Kappa-type opioid receptor
Type:G Protein-Coupled Receptor (GPCR)
Mol. Mass.:42648.76
Organism:Homo sapiens (Human)
Description:P41145
Residue:380
BDBM50224873
NameBDBM50224873
Synonyms:(6S,11R)-3-cyclopropylmethyl-6,11-dimethyl-1,2,3,4,5,6-hexahydro-2,6-methano-benzo[d]azocine-8-carboxylic acid [2-(4'-methoxy-biphenyl-4-yl)-ethyl]-amide | CHEMBL249985
TypeSmall organic molecule
Emp. Form.C34H40N2O2
Mol. Mass.508.6936
SMILESCOc1ccc(cc1)-c1ccc(CCNC(=O)c2ccc3CC4[C@H](C)[C@](C)(CCN4CC4CC4)c3c2)cc1