Reaction Details
TargetKappa-type opioid receptor
LigandBDBM50224869
Substrate/Competitorn/a
Meas. Tech.ChEMBL_458380 (CHEMBL941714)
Ki 3.2±n/a nM
Citation VanAlstine, MAWentland, MPCohen, DJBidlack, JM Redefining the structure-activity relationships of 2,6-methano-3-benzazocines. 5. Opioid receptor binding properties of N-((4'-phenyl)-phenethyl) analogues of 8-CAC. Bioorg Med Chem Lett17:6516-20 (2007) 
 
Kappa-type opioid receptor
Name:Kappa-type opioid receptor
Type:G Protein-Coupled Receptor (GPCR)
Mol. Mass.:42648.76
Organism:Homo sapiens (Human)
Description:P41145
Residue:380
BDBM50224869
NameBDBM50224869
Synonyms:(6S,11R)-3-cyclopropylmethyl-6,11-dimethyl-1,2,3,4,5,6-hexahydro-2,6-methano-benzo[d]azocine-8-carboxylic acid [2-(4'-chloro-biphenyl-4-yl)-ethyl]-amide | CHEMBL438871
TypeSmall organic molecule
Emp. Form.C33H37ClN2O
Mol. Mass.513.113
SMILESC[C@H]1C2Cc3ccc(cc3[C@@]1(C)CCN2CC1CC1)C(=O)NCCc1ccc(cc1)-c1ccc(Cl)cc1