Reaction Details
TargetSerine/threonine-protein kinase Chk1
LigandBDBM50224894
Substrate/Competitorn/a
Meas. Tech.ChEMBL_458388 (CHEMBL942709)
IC50 1±n/a nM
Citation Tao, ZFChen, ZBui, MHKovar, PJohnson, EBouska, JZhang, HRosenberg, SSowin, TLin, NH Macrocyclic ureas as potent and selective Chk1 inhibitors: an improved synthesis, kinome profiling, structure-activity relationships, and preliminary pharmacokinetics. Bioorg Med Chem Lett17:6593-601 (2007) 
 
Serine/threonine-protein kinase Chk1
Name:Serine/threonine-protein kinase Chk1
Type:Enzyme Catalytic Domain
Mol. Mass.:54443.02
Organism:Homo sapiens (Human)
Description:gi_166295192
Residue:476
BDBM50224894
NameBDBM50224894
Synonyms:(Z)-7-chloro-8-(2-morpholin-4-yl-ethoxy)-3-oxo-11,16-dioxa-2,4,19,21-tetraaza-tricyclo[15.3.1.0*5,10*]henicosa-1(21),5,7,9,13,17,19-heptaene-18-carbonitrile | CHEMBL248553
TypeSmall organic molecule
Emp. Form.C22H23ClN6O5
Mol. Mass.486.908
SMILESClc1cc2NC(=O)Nc3cnc(C#N)c(OC\C=C/COc2cc1OCCN1CCOCC1)n3