Reaction Details
TargetSerine/threonine-protein kinase Chk1
LigandBDBM50224885
Substrate/Competitorn/a
Meas. Tech.ChEMBL_458388 (CHEMBL942709)
IC50 2±n/a nM
Citation Tao, ZFChen, ZBui, MHKovar, PJohnson, EBouska, JZhang, HRosenberg, SSowin, TLin, NH Macrocyclic ureas as potent and selective Chk1 inhibitors: an improved synthesis, kinome profiling, structure-activity relationships, and preliminary pharmacokinetics. Bioorg Med Chem Lett17:6593-601 (2007) 
 
Serine/threonine-protein kinase Chk1
Name:Serine/threonine-protein kinase Chk1
Type:Enzyme Catalytic Domain
Mol. Mass.:54443.02
Organism:Homo sapiens (Human)
Description:gi_166295192
Residue:476
BDBM50224885
NameBDBM50224885
Synonyms:(Z)-7-chloro-8-methylamino-3-oxo-11,16-dioxa-2,4,19,21-tetraaza-tricyclo[15.3.1.0*5,10*]henicosa-1(21),5,7,9,13,17,19-heptaene-18-carbonitrile | CHEMBL249764
TypeSmall organic molecule
Emp. Form.C17H15ClN6O3
Mol. Mass.386.792
SMILESCNc1cc2OC\C=C/COc3nc(NC(=O)Nc2cc1Cl)cnc3C#N