Reaction Details
TargetSerine/threonine-protein kinase Chk1
LigandBDBM50224906
Substrate/Competitorn/a
Meas. Tech.ChEMBL_458388 (CHEMBL942709)
IC50 3±n/a nM
Citation Tao, ZFChen, ZBui, MHKovar, PJohnson, EBouska, JZhang, HRosenberg, SSowin, TLin, NH Macrocyclic ureas as potent and selective Chk1 inhibitors: an improved synthesis, kinome profiling, structure-activity relationships, and preliminary pharmacokinetics. Bioorg Med Chem Lett17:6593-601 (2007) 
 
Serine/threonine-protein kinase Chk1
Name:Serine/threonine-protein kinase Chk1
Type:Enzyme Catalytic Domain
Mol. Mass.:54443.02
Organism:Homo sapiens (Human)
Description:gi_166295192
Residue:476
BDBM50224906
NameBDBM50224906
Synonyms:(7-chloro-18-cyano-3-oxo-11,16-dioxa-2,4,19,21-tetraaza-tricyclo[15.3.1.0*5,10*]henicosa-1(21),5,7,9,17,19-hexaen-8-yl)-carbamic acid 2-morpholin-4-yl-ethyl ester | CHEMBL248952
TypeSmall organic molecule
Emp. Form.C23H26ClN7O6
Mol. Mass.531.949
SMILESClc1cc2NC(=O)Nc3cnc(C#N)c(OCCCCOc2cc1NC(=O)OCCN1CCOCC1)n3