Reaction Details
TargetMast/stem cell growth factor receptor Kit
LigandBDBM50224883
Substrate/Competitorn/a
Meas. Tech.ChEMBL_458411 (CHEMBL942732)
Ki 1119±n/a nM
Citation Tao, ZFChen, ZBui, MHKovar, PJohnson, EBouska, JZhang, HRosenberg, SSowin, TLin, NH Macrocyclic ureas as potent and selective Chk1 inhibitors: an improved synthesis, kinome profiling, structure-activity relationships, and preliminary pharmacokinetics. Bioorg Med Chem Lett17:6593-601 (2007) 
 
Mast/stem cell growth factor receptor Kit
Name:Mast/stem cell growth factor receptor Kit
Type:Protein
Mol. Mass.:109869.37
Organism:Homo sapiens (Human)
Description:P10721
Residue:976
BDBM50224883
NameBDBM50224883
Synonyms:7-chloro-3-oxo-8-[(thiazol-5-ylmethyl)-amino]-11,16-dioxa-2,4,19,21-tetraaza-tricyclo[15.3.1.0*5,10*]henicosa-1(21),5,7,9,17,19-hexaene-18-crbonitrile | CHEMBL248757
TypeSmall organic molecule
Emp. Form.C20H18ClN7O3S
Mol. Mass.471.92
SMILESClc1cc2NC(=O)Nc3cnc(C#N)c(OCCCCOc2cc1NCc1cncs1)n3