Reaction Details
TargetCannabinoid receptor 1
LigandBDBM50225148
Substrate/Competitorn/a
Meas. Tech.ChEMBL_458569 (CHEMBL941882)
Ki 290±n/a nM
Citation Manera, CCascio, MGBenetti, VAllarà, MTuccinardi, TMartinelli, ASaccomanni, GVivoli, EGhelardini, CDi Marzo, VFerrarini, PL New 1,8-naphthyridine and quinoline derivatives as CB2 selective agonists. Bioorg Med Chem Lett17:6505-10 (2007) 
 
Cannabinoid receptor 1
Name:Cannabinoid receptor 1
Type:G Protein-Coupled Receptor (GPCR)
Mol. Mass.:52868.96
Organism:Homo sapiens (Human)
Description:P21554
Residue:472
BDBM50225148
NameBDBM50225148
Synonyms:CHEMBL250769 | N-cycloheptyl-1-(2-morpholinoethyl)-4-oxo-1,4-dihydroquinoline-3-carboxamide
TypeSmall organic molecule
Emp. Form.C23H31N3O3
Mol. Mass.397.5105
SMILESO=C(NC1CCCCCC1)c1cn(CCN2CCOCC2)c2ccccc2c1=O