Reaction Details
TargetCannabinoid receptor 1
LigandBDBM50225153
Substrate/Competitorn/a
Meas. Tech.ChEMBL_458569 (CHEMBL941882)
Ki>5600±n/a nM
Citation Manera, CCascio, MGBenetti, VAllarà, MTuccinardi, TMartinelli, ASaccomanni, GVivoli, EGhelardini, CDi Marzo, VFerrarini, PL New 1,8-naphthyridine and quinoline derivatives as CB2 selective agonists. Bioorg Med Chem Lett17:6505-10 (2007) 
 
Cannabinoid receptor 1
Name:Cannabinoid receptor 1
Type:G Protein-Coupled Receptor (GPCR)
Mol. Mass.:52868.96
Organism:Homo sapiens (Human)
Description:P21554
Residue:472
BDBM50225153
NameBDBM50225153
Synonyms:CHEMBL400268 | N-cyclohexyl-7-(dimethylamino)-1-(2-morpholinoethyl)-4-oxo-1,4-dihydro-1,8-naphthyridine-3-carboxamide
TypeSmall organic molecule
Emp. Form.C23H33N5O3
Mol. Mass.427.5398
SMILESCN(C)c1ccc2c(n1)n(CCN1CCOCC1)cc(C(=O)NC1CCCCC1)c2=O