Reaction Details
TargetCannabinoid receptor 2
LigandBDBM21281
Substrate/Competitorn/a
Meas. Tech.ChEMBL_458570 (CHEMBL941883)
Ki 2.1±n/a nM
Citation Manera, CCascio, MGBenetti, VAllarà, MTuccinardi, TMartinelli, ASaccomanni, GVivoli, EGhelardini, CDi Marzo, VFerrarini, PL New 1,8-naphthyridine and quinoline derivatives as CB2 selective agonists. Bioorg Med Chem Lett17:6505-10 (2007) 
 
Cannabinoid receptor 2
Name:Cannabinoid receptor 2
Type:G Protein-Coupled Receptor (GPCR)
Mol. Mass.:39690.94
Organism:Homo sapiens (Human)
Description:P34972
Residue:360
BDBM21281
NameBDBM21281
Synonyms:(11R)-2-methyl-11-(morpholin-4-ylmethyl)-3-(naphthalen-1-ylcarbonyl)-9-oxa-1-azatricyclo[6.3.1.0^{4,12}]dodeca-2,4(12),5,7-tetraene CHEMBL188 WIN 55212-2 WIN55212-2
TypeAnalgesic
Emp. Form.C27H26N2O3
Mol. Mass.426.5069
SMILESCc1c(C(=O)c2cccc3ccccc23)c2cccc3OC[C@@H](CN4CCOCC4)n1c23