Reaction Details
TargetCannabinoid receptor 2
LigandBDBM50160434
Substrate/Competitorn/a
Meas. Tech.ChEMBL_458570 (CHEMBL941883)
Ki 36±n/a nM
Citation Manera, CCascio, MGBenetti, VAllarà, MTuccinardi, TMartinelli, ASaccomanni, GVivoli, EGhelardini, CDi Marzo, VFerrarini, PL New 1,8-naphthyridine and quinoline derivatives as CB2 selective agonists. Bioorg Med Chem Lett17:6505-10 (2007) 
 
Cannabinoid receptor 2
Name:Cannabinoid receptor 2
Type:G Protein-Coupled Receptor (GPCR)
Mol. Mass.:39690.94
Organism:Homo sapiens (Human)
Description:P34972
Residue:360
BDBM50160434
NameBDBM50160434
Synonyms:(6-iodo-2-methyl-1-(2-morpholinoethyl)-1H-indol-3-yl)(4-methoxyphenyl)methanone AM630 [6-iodo-2-methyl-1-(2-morpholin-4-ylethyl)indol-3-yl]-(4-methoxyphenyl)methanone | {6-iodo-2-methyl-1-[2-(4-morpholinyl)ethyl]-1H-indol-3-yl}[4-(methyloxy)phenyl]methanone
TypeSmall organic molecule
Emp. Form.C23H25IN2O3
Mol. Mass.504.3607
SMILESCOc1ccc(cc1)C(=O)c1c(C)n(CCN2CCOCC2)c2cc(I)ccc12