Reaction Details
TargetCannabinoid receptor 2
LigandBDBM50225148
Substrate/Competitorn/a
Meas. Tech.ChEMBL_458570 (CHEMBL941883)
Ki 28±n/a nM
Citation Manera, CCascio, MGBenetti, VAllarà, MTuccinardi, TMartinelli, ASaccomanni, GVivoli, EGhelardini, CDi Marzo, VFerrarini, PL New 1,8-naphthyridine and quinoline derivatives as CB2 selective agonists. Bioorg Med Chem Lett17:6505-10 (2007) 
 
Cannabinoid receptor 2
Name:Cannabinoid receptor 2
Type:G Protein-Coupled Receptor (GPCR)
Mol. Mass.:39690.94
Organism:Homo sapiens (Human)
Description:P34972
Residue:360
BDBM50225148
NameBDBM50225148
Synonyms:CHEMBL250769 | N-cycloheptyl-1-(2-morpholinoethyl)-4-oxo-1,4-dihydroquinoline-3-carboxamide
TypeSmall organic molecule
Emp. Form.C23H31N3O3
Mol. Mass.397.5105
SMILESO=C(NC1CCCCCC1)c1cn(CCN2CCOCC2)c2ccccc2c1=O