Reaction Details
TargetCarbonic anhydrase 2
LigandBDBM50211832
Substrate/Competitorn/a
Meas. Tech.ChEMBL_459050 (CHEMBL925142)
Ki 8±n/a nM
Citation Supuran, CTScozzafava, A Carbonic anhydrases as targets for medicinal chemistry. Bioorg Med Chem15:4336-50 (2007) 
 
Carbonic anhydrase 2
Name:Carbonic anhydrase 2
Type:Enzyme
Mol. Mass.:29250.71
Organism:Homo sapiens (Human)
Description:P00918
Residue:260
BDBM50211832
NameBDBM50211832
Synonyms:4-[(aminocarbonyl)amino]-N-[4-(aminosulfonyl)phenyl]benzenesulfonamide CHEMBL120304
TypeSmall organic molecule
Emp. Form.C13H14N4O5S2
Mol. Mass.370.404
SMILESNC(=O)Nc1ccc(cc1)S(=O)(=O)Nc1ccc(cc1)S(N)(=O)=O