Reaction Details
TargetCarbonic anhydrase 4
LigandBDBM50211830
Substrate/Competitorn/a
Meas. Tech.ChEMBL_459061 (CHEMBL925153)
Ki 8±n/a nM
Citation Supuran, CTScozzafava, A Carbonic anhydrases as targets for medicinal chemistry. Bioorg Med Chem15:4336-50 (2007) 
 
Carbonic anhydrase 4
Name:Carbonic anhydrase 4
Type:Enzyme
Mol. Mass.:35152.74
Organism:Bos taurus (bovine)
Description:Bovine isozyme, isolated from lung microsomes
Residue:312
BDBM50211830
NameBDBM50211830
Synonyms:5-[3-(3,4-dichloro-phenyl)-ureido]-[1,3,4]thiadiazole-2-sulfonic acid amide | CHEMBL253997
TypeSmall organic molecule
Emp. Form.C9H7Cl2N5O3S2
Mol. Mass.368.22
SMILESNS(=O)(=O)c1nnc(NC(=O)Nc2ccc(Cl)c(Cl)c2)s1