Reaction Details
TargetCarbonic anhydrase 4
LigandBDBM50211836
Substrate/Competitorn/a
Meas. Tech.ChEMBL_459061 (CHEMBL925153)
Ki 24±n/a nM
Citation Supuran, CTScozzafava, A Carbonic anhydrases as targets for medicinal chemistry. Bioorg Med Chem15:4336-50 (2007) 
 
Carbonic anhydrase 4
Name:Carbonic anhydrase 4
Type:Enzyme
Mol. Mass.:35152.74
Organism:Bos taurus (bovine)
Description:Bovine isozyme, isolated from lung microsomes
Residue:312
BDBM50211836
NameBDBM50211836
Synonyms:4-(2-{[({[(3,4-dichlorophenyl)amino]carbonyl}amino)carbonothioyl]amino}ethyl)benzenesulfonamide | CHEMBL254834
TypeSmall organic molecule
Emp. Form.C16H16Cl2N4O3S2
Mol. Mass.447.359
SMILESNS(=O)(=O)c1ccc(CCNC(=S)NC(=O)Nc2ccc(Cl)c(Cl)c2)cc1