Reaction Details
TargetCarbonic anhydrase 1
LigandBDBM50211827
Substrate/Competitorn/a
Meas. Tech.ChEMBL_459049 (CHEMBL925141)
Ki 50±n/a nM
Citation Supuran, CTScozzafava, A Carbonic anhydrases as targets for medicinal chemistry. Bioorg Med Chem15:4336-50 (2007) 
 
Carbonic anhydrase 1
Name:Carbonic anhydrase 1
Type:Enzyme
Mol. Mass.:28873.37
Organism:Homo sapiens (Human)
Description:P00915
Residue:261
BDBM50211827
NameBDBM50211827
Synonyms:4-[2-(3-Phenyl-thioureido)-ethyl]-benzenesulfonamide | CHEMBL254833
TypeSmall organic molecule
Emp. Form.C15H17N3O2S2
Mol. Mass.335.444
SMILESNS(=O)(=O)c1ccc(CCNC(=S)Nc2ccccc2)cc1