Reaction Details
TargetCarbonic anhydrase 1
LigandBDBM50211833
Substrate/Competitorn/a
Meas. Tech.ChEMBL_459049 (CHEMBL925141)
Ki 200±n/a nM
Citation Supuran, CTScozzafava, A Carbonic anhydrases as targets for medicinal chemistry. Bioorg Med Chem15:4336-50 (2007) 
 
Carbonic anhydrase 1
Name:Carbonic anhydrase 1
Type:Enzyme
Mol. Mass.:28873.37
Organism:Homo sapiens (Human)
Description:P00915
Residue:261
BDBM50211833
NameBDBM50211833
Synonyms:4-(2-((1-methyl-1H-pyrrol-2-yl)methyleneamino)ethyl)benzenesulfonamide | CHEMBL254211
TypeSmall organic molecule
Emp. Form.C14H17N3O2S
Mol. Mass.291.369
SMILESCn1cccc1\C=N\CCc1ccc(cc1)S(N)(=O)=O