Reaction Details
TargetCarbonic anhydrase 14
LigandBDBM10885
Substrate/Competitorn/a
Meas. Tech.ChEMBL_459060 (CHEMBL925152)
Ki 24±n/a nM
Citation Supuran, CTScozzafava, A Carbonic anhydrases as targets for medicinal chemistry. Bioorg Med Chem15:4336-50 (2007) 
 
Carbonic anhydrase 14
Name:Carbonic anhydrase 14
Type:Enzyme
Mol. Mass.:37665.67
Organism:Homo sapiens (Human)
Description:Human (cloned) isozyme.
Residue:337
BDBM10885
NameBDBM10885
Synonyms:(4R)-4-(ethylamino)-2-(3-methoxypropyl)-1,1-dioxo-2H,3H,4H-1,7,2-thieno[3,2-e][1,2]thiazine-6-sulfonamide AL-4862 Brinzolamide (BRZ) | brinzolamide
TypeSmall organic molecule
Emp. Form.C12H21N3O5S3
Mol. Mass.383.507
SMILESCCN[C@H]1CN(CCCOC)S(=O)(=O)c2sc(cc12)S(N)(=O)=O