Reaction Details
TargetCarbonic anhydrase 9
LigandBDBM13055
Substrate/Competitorn/a
Meas. Tech.ChEMBL_459057 (CHEMBL925149)
Ki 4580±n/a nM
Citation Supuran, CTScozzafava, A Carbonic anhydrases as targets for medicinal chemistry. Bioorg Med Chem15:4336-50 (2007) 
 
Carbonic anhydrase 9
Name:Carbonic anhydrase 9
Type:Enzyme
Mol. Mass.:49669.03
Organism:Homo sapiens (Human)
Description:Catalytic domain of human cloned isozyme was used in the assay
Residue:459
BDBM13055
NameBDBM13055
Synonyms:CHEMBL283695 Topiramate Sulfamide Analogue 8 | amino-N-{[(1R,2S,6S,9R)-4,4,11,11-tetramethyl-3,5,7,10,12-pentaoxatricyclo[7.3.0.0^{2,6}]dodecan-6-yl]methyl}sulfonamide
TypeSmall organic molecule
Emp. Form.C12H22N2O7S
Mol. Mass.338.377
SMILESCC1(C)O[C@@H]2CO[C@@]3(CNS(N)(=O)=O)OC(C)(C)O[C@H]3[C@@H]2O1