Reaction Details
TargetPancreatic triacylglycerol lipase
LigandBDBM50371232
Substrate/Competitorn/a
Meas. Tech.ChEMBL_459067 (CHEMBL925170)
IC50 36000±n/a nM
Citation Jain, KSKathiravan, MKSomani, RSShishoo, CJ The biology and chemistry of hyperlipidemia. Bioorg Med Chem15:4674-99 (2007) 
 
Pancreatic triacylglycerol lipase
Name:Pancreatic triacylglycerol lipase
Type:PROTEIN
Mol. Mass.:51157.75
Organism:Homo sapiens (Human)
Description:ChEMBL_527250
Residue:465
BDBM50371232
NameBDBM50371232
Synonyms:CARNOSIC ACID
TypeSmall organic molecule
Emp. Form.C20H28O4
Mol. Mass.332.4339
SMILESCC(C)c1cc2CC[C@H]3C(C)(C)CCC[C@]3(C(O)=O)c2c(O)c1O