Reaction Details
TargetCytochrome P450 1A1
LigandBDBM50134367
Substrate/Competitorn/a
Meas. Tech.ChEMBL_459099 (CHEMBL926267)
IC50 61±n/a nM
Citation Bruno, RDNjar, VC Targeting cytochrome P450 enzymes: a new approach in anti-cancer drug development. Bioorg Med Chem15:5047-60 (2007) 
 
Cytochrome P450 1A1
Name:Cytochrome P450 1A1
Type:Protein
Mol. Mass.:58177.23
Organism:Homo sapiens (Human)
Description:P04798
Residue:512
BDBM50134367
NameBDBM50134367
Synonyms:2-[(Z)-2-(3,5-Dimethoxy-phenyl)-vinyl]-thiophene CHEMBL122532
TypeSmall organic molecule
Emp. Form.C14H14O2S
Mol. Mass.246.325
SMILESCOc1cc(OC)cc(\C=C/c2cccs2)c1