Reaction Details
TargetPeroxisome proliferator-activated receptor delta
LigandBDBM28799
Substrate/Competitorn/a
Meas. Tech.ChEMBL_459987 (CHEMBL944030)
EC50 150±n/a nM
Citation Matthews, JMChen, XCryan, EHlasta, DJRybczynski, PJStrauss, KTang, YXu, JZYang, MZhou, LDemarest, KT Design and synthesis of indane-ureido-thioisobutyric acids: A novel class of PPARalpha agonists. Bioorg Med Chem Lett17:6773-8 (2008) 
 
Peroxisome proliferator-activated receptor delta
Name:Peroxisome proliferator-activated receptor delta
Type:Enzyme
Mol. Mass.:49910.45
Organism:Homo sapiens (Human)
Description:Q03181
Residue:441
BDBM28799
NameBDBM28799
Synonyms:2-{[4-(2-{[(2,4-difluorophenyl)carbamoyl](heptyl)amino}ethyl)phenyl]sulfanyl}-2-methylpropanoic acid GW 9578 GW9578
TypeSmall organic molecule
Emp. Form.C26H34F2N2O3S
Mol. Mass.492.622
SMILESCCCCCCCN(CCc1ccc(SC(C)(C)C(O)=O)cc1)C(=O)Nc1ccc(F)cc1F