Reaction Details
TargetDelta-type opioid receptor
LigandBDBM50229424
Substrate/Competitorn/a
Meas. Tech.ChEMBL_460086 (CHEMBL924962)
Ki 3.0±n/a nM
Citation Tömböly, CBallet, SFeytens, DKövér, KEBorics, ALovas, SAl-Khrasani, MFürst, ZTóth, GBenyhe, STourwé, D Endomorphin-2 with a beta-turn backbone constraint retains the potent micro-opioid receptor agonist properties. J Med Chem51:173-7 (2008) 
 
Delta-type opioid receptor
Name:Delta-type opioid receptor
Type:G Protein-Coupled Receptor (GPCR)
Mol. Mass.:40465.04
Organism:Rattus norvegicus (rat)
Description:Competition binding assays were using CHO-K1 cell membranes expressing the opioid receptor.
Residue:372
BDBM50229424
NameBDBM50229424
Synonyms:CHEMBL250448 | Tyr-(R)-Aba-Gly-Phe-NH2
TypeSmall organic molecule
Emp. Form.C30H33N5O5
Mol. Mass.543.6135
SMILESN[C@@H](Cc1ccc(O)cc1)C(=O)N[C@@H]1Cc2ccccc2CN(CC(=O)N[C@@H](Cc2ccccc2)C(N)=O)C1=O