Reaction Details
TargetMu-type opioid receptor
LigandBDBM50229425
Substrate/Competitorn/a
Meas. Tech.ChEMBL_460085 (CHEMBL924961)
Ki 0.0293±n/a nM
Citation Tömböly, CBallet, SFeytens, DKövér, KEBorics, ALovas, SAl-Khrasani, MFürst, ZTóth, GBenyhe, STourwé, D Endomorphin-2 with a beta-turn backbone constraint retains the potent micro-opioid receptor agonist properties. J Med Chem51:173-7 (2008) 
 
Mu-type opioid receptor
Name:Mu-type opioid receptor
Type:G Protein-Coupled Receptor (GPCR)
Mol. Mass.:44503.11
Organism:Rattus norvegicus (rat)
Description:Competition binding assays were carried out using membrane preparations from transfected HN9.10 cells that constitutively expressed the mu opioid receptor.
Residue:398
BDBM50229425
NameBDBM50229425
Synonyms:CHEMBL401142 | Tyr-(R)-spiro-Aba-Gly-Phe-NH2
TypeSmall organic molecule
Emp. Form.C33H37N5O5
Mol. Mass.583.6774
SMILESN[C@@H](Cc1ccc(O)cc1)C(=O)N1CCC[C@]11Cc2ccccc2CN(CC(=O)N[C@@H](Cc2ccccc2)C(N)=O)C1=O