Reaction Details
TargetMelanocortin receptor 3
LigandBDBM50230823
Substrate/Competitorn/a
Meas. Tech.ChEMBL_460496 (CHEMBL926576)
IC50 84±n/a nM
Citation Mayorov, AVCai, MPalmer, ESDedek, MMCain, JPVan Scoy, ARTan, BVagner, JTrivedi, DHruby, VJ Structure-activity relationships of cyclic lactam analogues of alpha-melanocyte-stimulating hormone (alpha-MSH) targeting the human melanocortin-3 receptor. J Med Chem51:187-95 (2008) 
 
Melanocortin receptor 3
Name:Melanocortin receptor 3
Type:Enzyme
Mol. Mass.:36044.86
Organism:Homo sapiens (Human)
Description:P41968
Residue:323
BDBM50230823
NameBDBM50230823
Synonyms:CHEMBL411391 | c[CO-(CH2)2-CO-Nle-D-Phe-Arg-Trp-Lys]-NH2
TypeSmall organic molecule
Emp. Form.C42H59N11O7
Mol. Mass.829.9874
SMILESN[C@H]1CCCCC(=O)CCC(=O)NCCCC[C@H](NC(=O)[C@H](Cc2c[nH]c3ccccc23)NC(=O)[C@H](CCCN=C(N)N)NC(=O)[C@@H](Cc2ccccc2)NC1=O)C(N)=O