Reaction Details
TargetMelanocortin receptor 4
LigandBDBM50230824
Substrate/Competitorn/a
Meas. Tech.ChEMBL_460497 (CHEMBL926577)
IC50 330±n/a nM
Citation Mayorov, AVCai, MPalmer, ESDedek, MMCain, JPVan Scoy, ARTan, BVagner, JTrivedi, DHruby, VJ Structure-activity relationships of cyclic lactam analogues of alpha-melanocyte-stimulating hormone (alpha-MSH) targeting the human melanocortin-3 receptor. J Med Chem51:187-95 (2008) 
 
Melanocortin receptor 4
Name:Melanocortin receptor 4
Type:Enzyme
Mol. Mass.:36949.50
Organism:Homo sapiens (Human)
Description:P32245
Residue:332
BDBM50230824
NameBDBM50230824
Synonyms:CHEMBL398665 | c[CO-(CH2)3-CO-Pro-D-Nal(2)-Arg-Trp-Lys]-NH2
TypeSmall organic molecule
Emp. Form.C52H63N11O7
Mol. Mass.954.1261
SMILESNC(=N)NCCC[C@@H]1NC(=O)[C@@H](Cc2ccc3ccccc3c2)NC(=O)[C@@H]2CCCN2C(=O)c2ccccc2C(=O)CCCNCCCC[C@H](NC(=O)[C@H](Cc2c[nH]c3ccccc23)NC1=O)C(N)=O