Reaction Details
TargetPotassium voltage-gated channel subfamily H member 2
LigandBDBM50231775
Substrate/Competitorn/a
Meas. Tech.ChEMBL_460777 (CHEMBL944718)
IC50 800±n/a nM
Citation Kort, MEDrizin, IGregg, RJScanio, MJShi, LGross, MFAtkinson, RNJohnson, MSPacofsky, GJThomas, JBCarroll, WAKrambis, MJLiu, DShieh, CCZhang, XHernandez, GMikusa, JPZhong, CJoshi, SHonore, PRoeloffs, RMarsh, KCMurray, BPLiu, JWerness, SFaltynek, CRKrafte, DSJarvis, MFChapman, MLMarron, BE Discovery and biological evaluation of 5-aryl-2-furfuramides, potent and selective blockers of the Nav1.8 sodium channel with efficacy in models of neuropathic and inflammatory pain. J Med Chem51:407-16 (2008) 
 
Potassium voltage-gated channel subfamily H member 2
Name:Potassium voltage-gated channel subfamily H member 2
Type:Multi-pass membrane protein
Mol. Mass.:126672.65
Organism:Homo sapiens (Human)
Description:Q12809
Residue:1159
BDBM50231775
NameBDBM50231775
Synonyms:(R)-5-(4-chlorophenyl)-N-(1-(4-(3-(4-(cyclopropanecarbonyl)phenoxy)propyl)piperazin-1-yl)-1-oxopropan-2-yl)furan-2-carboxamide | CHEMBL251241
TypeSmall organic molecule
Emp. Form.C31H34ClN3O5
Mol. Mass.564.072
SMILESC[C@@H](NC(=O)c1ccc(o1)-c1ccc(Cl)cc1)C(=O)N1CCN(CCCOc2ccc(cc2)C(=O)C2CC2)CC1