Reaction Details
TargetSodium channel protein type 10 subunit alpha
LigandBDBM50231774
Substrate/Competitorn/a
Meas. Tech.ChEMBL_460715 (CHEMBL926786)
IC50 30±n/a nM
Citation Kort, MEDrizin, IGregg, RJScanio, MJShi, LGross, MFAtkinson, RNJohnson, MSPacofsky, GJThomas, JBCarroll, WAKrambis, MJLiu, DShieh, CCZhang, XHernandez, GMikusa, JPZhong, CJoshi, SHonore, PRoeloffs, RMarsh, KCMurray, BPLiu, JWerness, SFaltynek, CRKrafte, DSJarvis, MFChapman, MLMarron, BE Discovery and biological evaluation of 5-aryl-2-furfuramides, potent and selective blockers of the Nav1.8 sodium channel with efficacy in models of neuropathic and inflammatory pain. J Med Chem51:407-16 (2008) 
 
Sodium channel protein type 10 subunit alpha
Name:Sodium channel protein type 10 subunit alpha
Type:PROTEIN
Mol. Mass.:220545.77
Organism:Mus musculus
Description:ChEMBL_675096
Residue:1958
BDBM50231774
NameBDBM50231774
Synonyms:5-(4-chlorophenyl)-N-cyano-N'-(3-methylphenyl)furan-2-carboxamide | CHEMBL255023
TypeSmall organic molecule
Emp. Form.C19H14ClN3O
Mol. Mass.335.787
SMILESCc1cccc(c1)N=C(NC#N)c1ccc(o1)-c1ccc(Cl)cc1