Reaction Details
TargetPotassium voltage-gated channel subfamily H member 2
LigandBDBM50231772
Substrate/Competitorn/a
Meas. Tech.ChEMBL_460777 (CHEMBL944718)
IC50 5300±n/a nM
Citation Kort, MEDrizin, IGregg, RJScanio, MJShi, LGross, MFAtkinson, RNJohnson, MSPacofsky, GJThomas, JBCarroll, WAKrambis, MJLiu, DShieh, CCZhang, XHernandez, GMikusa, JPZhong, CJoshi, SHonore, PRoeloffs, RMarsh, KCMurray, BPLiu, JWerness, SFaltynek, CRKrafte, DSJarvis, MFChapman, MLMarron, BE Discovery and biological evaluation of 5-aryl-2-furfuramides, potent and selective blockers of the Nav1.8 sodium channel with efficacy in models of neuropathic and inflammatory pain. J Med Chem51:407-16 (2008) 
 
Potassium voltage-gated channel subfamily H member 2
Name:Potassium voltage-gated channel subfamily H member 2
Type:Multi-pass membrane protein
Mol. Mass.:126672.65
Organism:Homo sapiens (Human)
Description:Q12809
Residue:1159
BDBM50231772
NameBDBM50231772
Synonyms:5-(4-chlorophenyl)-N-[(1-methyl-1,2,3,4-tetrahydroquinolin)-6-yl]furan-2-carboxamide | CHEMBL250877
TypeSmall organic molecule
Emp. Form.C21H19ClN2O2
Mol. Mass.366.841
SMILESCN1CCCc2cc(NC(=O)c3ccc(o3)-c3ccc(Cl)cc3)ccc12