Reaction Details
TargetSodium channel protein type 10 subunit alpha
LigandBDBM50212239
Substrate/Competitorn/a
Meas. Tech.ChEMBL_460789 (CHEMBL944730)
IC50 8±n/a nM
Citation Kort, MEDrizin, IGregg, RJScanio, MJShi, LGross, MFAtkinson, RNJohnson, MSPacofsky, GJThomas, JBCarroll, WAKrambis, MJLiu, DShieh, CCZhang, XHernandez, GMikusa, JPZhong, CJoshi, SHonore, PRoeloffs, RMarsh, KCMurray, BPLiu, JWerness, SFaltynek, CRKrafte, DSJarvis, MFChapman, MLMarron, BE Discovery and biological evaluation of 5-aryl-2-furfuramides, potent and selective blockers of the Nav1.8 sodium channel with efficacy in models of neuropathic and inflammatory pain. J Med Chem51:407-16 (2008) 
 
Sodium channel protein type 10 subunit alpha
Name:Sodium channel protein type 10 subunit alpha
Type:Enzyme
Mol. Mass.:220609.21
Organism:Homo sapiens (Human)
Description:Q9Y5Y9
Residue:1956
BDBM50212239
NameBDBM50212239
Synonyms:5-(4-chlorophenyl)-N-(3,5-dimethoxyphenyl)furan-2-carboxamide CHEMBL250699
TypeSmall organic molecule
Emp. Form.C19H16ClNO4
Mol. Mass.357.788
SMILESCOc1cc(NC(=O)c2ccc(o2)-c2ccc(Cl)cc2)cc(OC)c1