Reaction Details
TargetSodium channel protein type 10 subunit alpha
LigandBDBM50371254
Substrate/Competitorn/a
Meas. Tech.ChEMBL_460715 (CHEMBL926786)
IC50 430±n/a nM
Citation Kort, MEDrizin, IGregg, RJScanio, MJShi, LGross, MFAtkinson, RNJohnson, MSPacofsky, GJThomas, JBCarroll, WAKrambis, MJLiu, DShieh, CCZhang, XHernandez, GMikusa, JPZhong, CJoshi, SHonore, PRoeloffs, RMarsh, KCMurray, BPLiu, JWerness, SFaltynek, CRKrafte, DSJarvis, MFChapman, MLMarron, BE Discovery and biological evaluation of 5-aryl-2-furfuramides, potent and selective blockers of the Nav1.8 sodium channel with efficacy in models of neuropathic and inflammatory pain. J Med Chem51:407-16 (2008) 
 
Sodium channel protein type 10 subunit alpha
Name:Sodium channel protein type 10 subunit alpha
Type:PROTEIN
Mol. Mass.:220545.77
Organism:Mus musculus
Description:ChEMBL_675096
Residue:1958
BDBM50371254
NameBDBM50371254
Synonyms:CHEMBL429830
TypeSmall organic molecule
Emp. Form.C20H19NO3
Mol. Mass.321.3698
SMILESCCOc1ccc(cc1)-c1ccc(o1)C(=O)Nc1cccc(C)c1