Reaction Details
TargetDipeptidyl peptidase 4
LigandBDBM50232518
Substrate/Competitorn/a
Meas. Tech.ChEMBL_461024 (CHEMBL944056)
IC50 0.4±n/a nM
Citation Kim, DKowalchick, JEBrockunier, LLParmee, EREiermann, GJFisher, MHHe, HLeiting, BLyons, KScapin, GPatel, SBPetrov, APryor, KDRoy, RSWu, JKZhang, XWyvratt, MJZhang, BBZhu, LThornberry, NAWeber, AE Discovery of potent and selective dipeptidyl peptidase IV inhibitors derived from beta-aminoamides bearing subsituted triazolopiperazines. J Med Chem51:589-602 (2008) 
 
Dipeptidyl peptidase 4
Name:Dipeptidyl peptidase 4
Type:Enzyme
Mol. Mass.:88271.01
Organism:Homo sapiens (Human)
Description:P27487
Residue:766
BDBM50232518
NameBDBM50232518
Synonyms:(2R)-4-oxo-4-[8-(pyridin-2-ylmethyl)-3-(trifluoromethyl)-5,6-dihydro[1,2,4]triazolo[4,3-a]pyrazin-7(8H)-yl]-1-(2,4,5-trifluorophenyl)butan-2-amine hydrochloride | CHEMBL557176
TypeSmall organic molecule
Emp. Form.C22H20F6N6O
Mol. Mass.498.4242
SMILESN[C@@H](CC(=O)N1CCn2c(nnc2C(F)(F)F)C1Cc1ccccn1)Cc1cc(F)c(F)cc1F