Reaction Details
TargetDisintegrin and metalloproteinase domain-containing protein 17
LigandBDBM50227856
Substrate/Competitorn/a
Meas. Tech.ChEMBL_461588 (CHEMBL927611)
Ki 0.15±n/a nM
Citation Duan, JJChen, LLu, ZXue, CBLiu, RQCovington, MBQian, MWasserman, ZRVaddi, KChrist, DDTrzaskos, JMNewton, RCDecicco, CP Discovery of beta-benzamido hydroxamic acids as potent, selective, and orally bioavailable TACE inhibitors. Bioorg Med Chem Lett18:241-6 (2008) 
 
Disintegrin and metalloproteinase domain-containing protein 17
Name:Disintegrin and metalloproteinase domain-containing protein 17
Type:Metalloprotease
Mol. Mass.:12197.99
Organism:Sus scrofa (pig)
Description:Partially purified TACE was obtained from porcine spleen.
Residue:112
BDBM50227856
NameBDBM50227856
Synonyms:(3R,4R)-N-hydroxy-4-(4-((2-methylquinolin-4-yl)methoxy)benzamido)-tetrahydro-2H-pyran-3-carboxamide CHEMBL252893
TypeSmall organic molecule
Emp. Form.C24H25N3O5
Mol. Mass.435.4724
SMILESCc1cc(COc2ccc(cc2)C(=O)N[C@@H]2CCOC[C@@H]2C(=O)NO)c2ccccc2n1