Reaction Details
TargetCoagulation factor X
LigandBDBM50228912
Substrate/Competitorn/a
Meas. Tech.ChEMBL_461701 (CHEMBL927722)
Ki 0.32±n/a nM
Citation Varnes, JGWacker, DAPinto, DJOrwat, MJTheroff, JPWells, BGalemo, RALuettgen, JMKnabb, RMBai, SHe, KLam, PYWexler, RR Structure-activity relationship and pharmacokinetic profile of 5-ketopyrazole factor Xa inhibitors. Bioorg Med Chem Lett18:749-54 (2008) 
 
Coagulation factor X
Name:Coagulation factor X
Type:Enzyme
Mol. Mass.:54726.60
Organism:Homo sapiens (Human)
Description:n/a
Residue:488
BDBM50228912
NameBDBM50228912
Synonyms:1-[2-(3-amino-benzo[d]isoxazol-5-yl)-5-trifluoromethyl-2H-pyrazol-3-yl]-2-(2'-pyrrolidin-1-ylmethyl-biphenyl-4-yl)-ethanone | CHEMBL252453
TypeSmall organic molecule
Emp. Form.C30H26F3N5O2
Mol. Mass.545.5549
SMILESNc1noc2ccc(cc12)-n1nc(cc1C(=O)Cc1ccc(cc1)-c1ccccc1CN1CCCC1)C(F)(F)F