Reaction Details
TargetProthrombin
LigandBDBM50228926
Substrate/Competitorn/a
Meas. Tech.ChEMBL_461704 (CHEMBL927725)
Ki>15000±n/a nM
Citation Varnes, JGWacker, DAPinto, DJOrwat, MJTheroff, JPWells, BGalemo, RALuettgen, JMKnabb, RMBai, SHe, KLam, PYWexler, RR Structure-activity relationship and pharmacokinetic profile of 5-ketopyrazole factor Xa inhibitors. Bioorg Med Chem Lett18:749-54 (2008) 
 
Prothrombin
Name:Prothrombin
Type:Protein
Mol. Mass.:70029.57
Organism:Homo sapiens (Human)
Description:P00734
Residue:622
BDBM50228926
NameBDBM50228926
Synonyms:1-(3-fluoro-4-(2-(1-(4-methoxyphenyl)-3-(trifluoromethyl)-1H-pyrazol-5-yl)-2-oxoethyl)phenyl)pyridin-2(1H)-one | CHEMBL252853
TypeSmall organic molecule
Emp. Form.C24H17F4N3O3
Mol. Mass.471.4037
SMILESCOc1ccc(cc1)-n1nc(cc1C(=O)Cc1ccc(cc1F)-n1ccccc1=O)C(F)(F)F