Reaction Details
TargetProthrombin
LigandBDBM50228915
Substrate/Competitorn/a
Meas. Tech.ChEMBL_461704 (CHEMBL927725)
Ki 350±n/a nM
Citation Varnes, JGWacker, DAPinto, DJOrwat, MJTheroff, JPWells, BGalemo, RALuettgen, JMKnabb, RMBai, SHe, KLam, PYWexler, RR Structure-activity relationship and pharmacokinetic profile of 5-ketopyrazole factor Xa inhibitors. Bioorg Med Chem Lett18:749-54 (2008) 
 
Prothrombin
Name:Prothrombin
Type:Protein
Mol. Mass.:70029.57
Organism:Homo sapiens (Human)
Description:P00734
Residue:622
BDBM50228915
NameBDBM50228915
Synonyms:1-[2-(3-amino-benzo[d]isoxazol-5-yl)-5-trifluoromethyl-2H-pyrazol-3-yl]-2-[4-(2-dimethylaminomethyl-imidazol-1-yl)-phenyl]-ethanone | CHEMBL442292
TypeSmall organic molecule
Emp. Form.C25H22F3N7O2
Mol. Mass.509.4831
SMILESCN(C)Cc1nccn1-c1ccc(CC(=O)c2cc(nn2-c2ccc3onc(N)c3c2)C(F)(F)F)cc1