Reaction Details
TargetCoagulation factor X
LigandBDBM50228906
Substrate/Competitorn/a
Meas. Tech.ChEMBL_461701 (CHEMBL927722)
Ki 1±n/a nM
Citation Varnes, JGWacker, DAPinto, DJOrwat, MJTheroff, JPWells, BGalemo, RALuettgen, JMKnabb, RMBai, SHe, KLam, PYWexler, RR Structure-activity relationship and pharmacokinetic profile of 5-ketopyrazole factor Xa inhibitors. Bioorg Med Chem Lett18:749-54 (2008) 
 
Coagulation factor X
Name:Coagulation factor X
Type:Enzyme
Mol. Mass.:54726.60
Organism:Homo sapiens (Human)
Description:n/a
Residue:488
BDBM50228906
NameBDBM50228906
Synonyms:1-(4-(2-(1-(4-methoxyphenyl)-3-(trifluoromethyl)-1H-pyrazol-5-yl)-2-oxoethyl)phenyl)piperidin-2-one | CHEMBL252651
TypeSmall organic molecule
Emp. Form.C24H22F3N3O3
Mol. Mass.457.445
SMILESCOc1ccc(cc1)-n1nc(cc1C(=O)Cc1ccc(cc1)N1CCCCC1=O)C(F)(F)F