Reaction Details
TargetAcetylcholinesterase
LigandBDBM9022
Substrate/Competitorn/a
Meas. Tech.ChEMBL_462117 (CHEMBL945890)
IC50 0.020±n/a nM
Citation Cavalli, ABolognesi, MLMinarini, ARosini, MTumiatti, VRecanatini, MMelchiorre, C Multi-target-directed ligands to combat neurodegenerative diseases. J Med Chem51:347-72 (2008) 
 
Acetylcholinesterase
Name:Acetylcholinesterase
Type:Enzyme
Mol. Mass.:67792.70
Organism:Homo sapiens (Human)
Description:P22303
Residue:614
BDBM9022
NameBDBM9022
Synonyms:CHEMBL225567 N-[5-(6-Chloro-1,2,3,4-tetrahydroacridin-9-ylamino)-hexyl]-3-(1H-indol-3-yl)propionamide | N-{6-[(6-chloro-1,2,3,4-tetrahydroacridin-9-yl)amino]hexyl}-3-(1H-indol-3-yl)propanamide
TypeSmall organic molecule
Emp. Form.C30H35ClN4O
Mol. Mass.503.078
SMILESClc1ccc2c(NCCCCCCNC(=O)CCc3c[nH]c4ccccc34)c3CCCCc3nc2c1