Reaction Details
TargetAcetylcholinesterase
LigandBDBM10826
Substrate/Competitorn/a
Meas. Tech.ChEMBL_462117 (CHEMBL945890)
IC50 3060±n/a nM
Citation Cavalli, ABolognesi, MLMinarini, ARosini, MTumiatti, VRecanatini, MMelchiorre, C Multi-target-directed ligands to combat neurodegenerative diseases. J Med Chem51:347-72 (2008) 
 
Acetylcholinesterase
Name:Acetylcholinesterase
Type:Enzyme
Mol. Mass.:67792.70
Organism:Homo sapiens (Human)
Description:P22303
Residue:614
BDBM10826
NameBDBM10826
Synonyms:3-{2-[methyl(prop-2-yn-1-yl)amino]propyl}phenyl N-hexyl-N-methylcarbamate Phenethylamine deriv. 53d
TypeSmall organic molecule
Emp. Form.C21H32N2O2
Mol. Mass.344.491
SMILESCCCCCCN(C)C(=O)Oc1cccc(CC(C)N(C)CC#C)c1