Reaction Details
TargetAcetylcholinesterase
LigandBDBM50106731
Substrate/Competitorn/a
Meas. Tech.ChEMBL_462117 (CHEMBL945890)
IC50 1±n/a nM
Citation Cavalli, ABolognesi, MLMinarini, ARosini, MTumiatti, VRecanatini, MMelchiorre, C Multi-target-directed ligands to combat neurodegenerative diseases. J Med Chem51:347-72 (2008) 
 
Acetylcholinesterase
Name:Acetylcholinesterase
Type:Enzyme
Mol. Mass.:67792.70
Organism:Homo sapiens (Human)
Description:P22303
Residue:614
BDBM50106731
NameBDBM50106731
Synonyms:(+)-alpha-Lipoic acid (R)-1,2-Dithiolane-3-pentanoic acid 5-[(3R)-1,2-dithiolan-3-yl]pentanoic acid Lipoic acid Thioctic acid d-form | alpha-Lipoic acid
TypeSmall organic molecule
Emp. Form.C8H14O2S2
Mol. Mass.206.326
SMILESOC(=O)CCCC[C@@H]1CCSS1