Reaction Details
TargetAmine oxidase [flavin-containing] B
LigandBDBM50037429
Substrate/Competitorn/a
Meas. Tech.ChEMBL_462121 (CHEMBL945895)
Ki 70±n/a nM
Citation Cavalli, ABolognesi, MLMinarini, ARosini, MTumiatti, VRecanatini, MMelchiorre, C Multi-target-directed ligands to combat neurodegenerative diseases. J Med Chem51:347-72 (2008) 
 
Amine oxidase [flavin-containing] B
Name:Amine oxidase [flavin-containing] B
Type:Protein
Mol. Mass.:58768.76
Organism:Homo sapiens (Human)
Description:P27338
Residue:520
BDBM50037429
NameBDBM50037429
Synonyms:8-(3-chlorostyryl)caffeine CHEMBL26138 cid_5353365
TypeSmall organic molecule
Emp. Form.C16H15ClN4O2
Mol. Mass.330.769
SMILESCn1c(\C=C\c2cccc(Cl)c2)nc2n(C)c(=O)n(C)c(=O)c12