Reaction Details
TargetAcetylcholinesterase
LigandBDBM8961
Substrate/Competitorn/a
Meas. Tech.ChEMBL_462117 (CHEMBL945890)
IC50 420±n/a nM
Citation Cavalli, ABolognesi, MLMinarini, ARosini, MTumiatti, VRecanatini, MMelchiorre, C Multi-target-directed ligands to combat neurodegenerative diseases. J Med Chem51:347-72 (2008) 
 
Acetylcholinesterase
Name:Acetylcholinesterase
Type:Enzyme
Mol. Mass.:67792.70
Organism:Homo sapiens (Human)
Description:P22303
Residue:614
BDBM8961
NameBDBM8961
Synonyms:1,2,3,4-tetrahydro-9-acridinamine 9-THA CHEMBL1337960 Cognex Tracine cid_1935 | tacrine.HCl
TypeSmall organic molecule
Emp. Form.C13H14N2
Mol. Mass.198.2637
SMILESNc1c2CCCCc2nc2ccccc12