Reaction Details
TargetAcetylcholinesterase
LigandBDBM9023
Substrate/Competitorn/a
Meas. Tech.ChEMBL_462138 (CHEMBL945911)
IC50 9000±n/a nM
Citation Cavalli, ABolognesi, MLMinarini, ARosini, MTumiatti, VRecanatini, MMelchiorre, C Multi-target-directed ligands to combat neurodegenerative diseases. J Med Chem51:347-72 (2008) 
 
Acetylcholinesterase
Name:Acetylcholinesterase
Type:Enzyme
Mol. Mass.:67792.70
Organism:Homo sapiens (Human)
Description:P22303
Residue:614
BDBM9023
NameBDBM9023
Synonyms:CHEMBL225198 N-[7-(6-Chloro-1,2,3,4-tetrahydroacridin-9-ylamino)-heptyl]-3-(1H-indol-3-yl)propionamide | N-{7-[(6-chloro-1,2,3,4-tetrahydroacridin-9-yl)amino]heptyl}-3-(1H-indol-3-yl)propanamide
TypeSmall organic molecule
Emp. Form.C31H37ClN4O
Mol. Mass.517.105
SMILESClc1ccc2c(NCCCCCCCNC(=O)CCc3c[nH]c4ccccc34)c3CCCCc3nc2c1