Reaction Details
Target5-hydroxytryptamine receptor 3A
LigandBDBM50166984
Substrate/Competitorn/a
Meas. Tech.ChEMBL_462123 (CHEMBL945897)
Ki 5.6±n/a nM
Citation Cavalli, ABolognesi, MLMinarini, ARosini, MTumiatti, VRecanatini, MMelchiorre, C Multi-target-directed ligands to combat neurodegenerative diseases. J Med Chem51:347-72 (2008) 
 
5-hydroxytryptamine receptor 3A
Name:5-hydroxytryptamine receptor 3A
Type:Protein
Mol. Mass.:55283.27
Organism:Homo sapiens (Human)
Description:P46098
Residue:478
BDBM50166984
NameBDBM50166984
Synonyms:3-Methyl-2-(4-methyl-piperazin-1-yl)-quinoline-4-carboxylic acid [7-(1,2,3,4-tetrahydro-acridin-9-ylamino)-heptyl]-amide CHEMBL195241
TypeSmall organic molecule
Emp. Form.C36H46N6O
Mol. Mass.578.79
SMILESCN1CCN(CC1)c1nc2ccccc2c(C(=O)NCCCCCCCNc2c3CCCCc3nc3ccccc23)c1C