Reaction Details
TargetAmine oxidase [flavin-containing] B
LigandBDBM50231957
Substrate/Competitorn/a
Meas. Tech.ChEMBL_462121 (CHEMBL945895)
IC50 3.3±n/a nM
Citation Cavalli, ABolognesi, MLMinarini, ARosini, MTumiatti, VRecanatini, MMelchiorre, C Multi-target-directed ligands to combat neurodegenerative diseases. J Med Chem51:347-72 (2008) 
 
Amine oxidase [flavin-containing] B
Name:Amine oxidase [flavin-containing] B
Type:Protein
Mol. Mass.:58768.76
Organism:Homo sapiens (Human)
Description:P27338
Residue:520
BDBM50231957
NameBDBM50231957
Synonyms:7-(3-Chloro-benzyloxy)-3,4-dimethyl-chromen-2-one CHEMBL109018
TypeSmall organic molecule
Emp. Form.C18H15ClO3
Mol. Mass.314.763
SMILESCc1c(C)c(=O)oc2cc(OCc3cccc(Cl)c3)ccc12